Target
Mas-related G-protein coupled receptor member X2
Ligand
BDBM224017
Substrate
Meas. Tech.
PRESTO-Tango Assay
pH
7.4±0
Temperature
303.15±0 K
EC50
3.4e+3±9.4e+2 nM
Citation
 Lansu, KKarpiak, JLiu, JHuang, XPMcCorvy, JDKroeze, WKChe, TNagase, HCarroll, FIJin, JShoichet, BKRoth, BL In silico design of novel probes for the atypical opioid receptor MRGPRX2. Nat Chem Biol 13:529-536 (2017)  
Target
Name:
Mas-related G-protein coupled receptor member X2
Synonyms:
MRGPRX2 MRGX2_HUMAN Mas-related G-protein coupled receptor member X2
Type:
GPCR
Mol. Mass.:
37104.79
Organism:
Homo sapiens (Human)
Description:
Q96LB1
Residue:
330
  
Inhibitor
Name:
BDBM224017
Synonyms:
(+)-Morphine US10836728, Compound Morphine | US11534436, Compound morphine
Type:
Small organic molecule
Emp. Form.:
C17H19NO3
Mol. Mass.:
285.3377
SMILES:
CN1CC[C@]23[C@@H]4Oc5c2c(C[C@H]1[C@H]3C=C[C@H]4O)ccc5O
: