Target
Mas-related G-protein coupled receptor member X2
Ligand
BDBM224023
Substrate
Meas. Tech.
PRESTO-Tango Assay
pH
7.4±0
Temperature
303.15±0 K
EC50
4.2e+3±5e+2 nM
Citation
 Lansu, KKarpiak, JLiu, JHuang, XPMcCorvy, JDKroeze, WKChe, TNagase, HCarroll, FIJin, JShoichet, BKRoth, BL In silico design of novel probes for the atypical opioid receptor MRGPRX2. Nat Chem Biol 13:529-536 (2017)  
Target
Name:
Mas-related G-protein coupled receptor member X2
Synonyms:
MRGPRX2 MRGX2_HUMAN Mas-related G-protein coupled receptor member X2
Type:
GPCR
Mol. Mass.:
37104.79
Organism:
Homo sapiens (Human)
Description:
Q96LB1
Residue:
330
  
Inhibitor
Name:
BDBM224023
Synonyms:
Dextrorphan
Type:
Small organic molecule
Emp. Form.:
C17H23NO
Mol. Mass.:
257.3706
SMILES:
CN1CC[C@]23CCCC[C@@H]2[C@H]1Cc1ccc(O)cc31
: