Target
Serine/threonine-protein kinase Chk1 [2-280]
Ligand
BDBM225370
Substrate
Meas. Tech.
33P-Radiometric_Method1
Ki
11.5±n/a nM
Citation
 D3R, DD Abbott CHK1 Kinase D3R 221:0 (2015) Target
Name:
Serine/threonine-protein kinase Chk1 [2-280]
Synonyms:
CHEK1 CHK1_HUMAN | CHK1_Kinase
Type:
Mol. Mass.:
32109.16
Organism:
Homo sapiens (Human)
Description:
O14757[2-280]
Residue:
279
  
Inhibitor
Name:
BDBM225370
Synonyms:
Chk1_123
Type:
Small Organic Molecule
Emp. Form.:
C19H16N6O2
Mol. Mass.:
360.3693
SMILES:
COc1cc2Cc3c(n[nH]c3-c3ccc(cc3)-c3nn[nH]n3)-c2cc1OC
: