Target
Malate synthase G [C619A]
Ligand
BDBM225394
Substrate
Meas. Tech.
DNTB-Coupled_Enzyme_Assay
IC50
>100000±n/a nM
Citation
 D3R, DD Sacchettini GlcB D3R 223:0 (2015) Target
Name:
Malate synthase G [C619A]
Synonyms:
MASZ_MYCTO | glcB
Type:
Mol. Mass.:
80350.85
Organism:
Mycobacterium tuberculosis (strain CDC 1551 / Oshkosh)
Description:
P9WK16[C619A]
Residue:
741
  
Inhibitor
Name:
BDBM225394
Synonyms:
Sacchettini_21
Type:
Small Organic Molecule
Emp. Form.:
C18H16O4
Mol. Mass.:
296.3172
SMILES:
Cc1ccc(Cc2ccccc2)cc1C(=O)\C=C(/O)C(O)=O
: