Target
Tyrosine-protein kinase SYK [355-635]
Ligand
BDBM225476
Substrate
Meas. Tech.
SYK assay_HTRF
IC50
4188±n/a nM
Citation
 D3R, DD GSK SYK Kinase D3R 225:0 (2015) Target
Name:
Tyrosine-protein kinase SYK [355-635]
Synonyms:
KSYK_HUMAN SYK Kinase
Type:
Mol. Mass.:
32610.83
Organism:
Homo sapiens (Human)
Description:
P43405[355-635]
Residue:
281
  
Inhibitor
Name:
BDBM225476
Synonyms:
GTC000185A
Type:
Small Organic Molecule
Emp. Form.:
C23H24N8O
Mol. Mass.:
428.4897
SMILES:
CN1CCN(CC1)C(=O)c1ccc(Nc2nccc(Nc3cccc4[nH]ncc34)n2)cc1
: