Target
Tyrosine-protein kinase SYK [355-635]
Ligand
BDBM225499
Substrate
Meas. Tech.
SYK assay_HTRF
IC50
849±n/a nM
Citation
 D3R, DD GSK SYK Kinase D3R 225:0 (2015) Target
Name:
Tyrosine-protein kinase SYK [355-635]
Synonyms:
KSYK_HUMAN SYK Kinase
Type:
Mol. Mass.:
32610.83
Organism:
Homo sapiens (Human)
Description:
P43405[355-635]
Residue:
281
  
Inhibitor
Name:
BDBM225499
Synonyms:
GTC000208A
Type:
Small Organic Molecule
Emp. Form.:
C26H23N7O2
Mol. Mass.:
465.5065
SMILES:
COc1ccc(NC(=O)Cc2ccc(Nc3nccc(Nc4cccc5[nH]ncc45)n3)cc2)cc1
: