Target
Bile acid receptor
Ligand
BDBM225952
Substrate
Meas. Tech.
Scintillation Proximity Assay (SPA)
pH
7.4±n/a
IC50
45±n/a nM
Comments
extracted
Citation
 D3R, DD Drug Design Data Resource Grand Challenge 2 Dataset: FXR - Farnesoid X Receptor D3R 882:0 (2017) Target
Name:
Bile acid receptor
Synonyms:
BAR FXR HRR1 NR1H4_HUMAN RIP14 Retinoid X receptor-interacting protein 14 | farnesoid x receptor
Type:
Nuclear Receptor
Mol. Mass.:
55916.24
Organism:
Homo sapiens (Human)
Description:
Q96RI1
Residue:
486
  
Inhibitor
Name:
BDBM225952
Synonyms:
FXR_42
Type:
Small Organic Molecule
Emp. Form.:
C29H35F2N3O3
Mol. Mass.:
511.6033
SMILES:
COc1ccc(-c2nc3ccccc3n2[C@@H](C2CCC(F)(F)CC2)C(=O)NC2CCCCC2)c(OC)c1
: