Target
Androgen receptor [646-919]
Ligand
BDBM227645
Substrate
Meas. Tech.
Mammalian Two-Hybrid Assay
IC50
4e+3±n/a nM
Citation
 Jehle, KCato, LNeeb, AMuhle-Goll, CJung, NSmith, EWBuzon, VCarbó, LREstébanez-Perpiñá, ESchmitz, KFruk, LLuy, BChen, YCox, MBBräse, SBrown, MCato, AC Coregulator control of androgen receptor action by a novel nuclear receptor-binding motif. J Biol Chem 289:8839-51 (2014)  
Target
Name:
Androgen receptor [646-919]
Synonyms:
ANDR_HUMAN Androgen receptor ligand-binding domain (AR-LBD) NR3C4
Type:
Protein
Mol. Mass.:
31698.13
Organism:
Homo sapiens (Human)
Description:
Human AR hinge-LBD (646-919 aa)
Residue:
274
  
Inhibitor
Name:
BDBM227645
Synonyms:
Bag-1L (1-20) | MAQRGGARRPRGDRERLGSR
Type:
Small organic molecule
Emp. Form.:
C89H160N42O27S
Mol. Mass.:
2282.553
SMILES:
CSCC[C@H](N)C(=O)N[C@@H](C)C(=O)N[C@@H](CCC(N)=O)C(=O)N[C@@H](CCCNC(N)=N)C(=O)NCC(=O)NCC(=O)N[C@@H](C)C(=O)N[C@@H](CCCNC(N)=N)C(=O)N[C@@H](CCCNC(N)=N)C(=O)N1CCC[C@H]1C(=O)N[C@@H](CCCNC(N)=N)C(=O)NCC(=O)N[C@@H](CC(O)=O)C(=O)N[C@@H](CCCNC(N)=N)C(=O)N[C@@H](CCC(O)=O)C(=O)N[C@@H](CCCNC(N)=N)C(=O)N[C@@H](CC(C)C)C(=O)NCC(=O)N[C@@H](CO)C(=O)N[C@@H](CCCNC(N)=N)C(O)=O
: