Target
Melanocyte-stimulating hormone receptor
Ligand
BDBM230659
Substrate
Meas. Tech.
Radioligand Binding Assay
pH
7.4±n/a
Temperature
277.15±n/a K
IC50
20000±n/a nM
Comments
extracted
Citation
 Blaskovich, MACassidy, PJ Methods of modulating the activity of the MC5 receptor and treatment of conditions related to this receptor US Patent  US9340517 Publication Date 5/17/2016 
Target
Name:
Melanocyte-stimulating hormone receptor
Synonyms:
MC1-R MSH-R MSHR_HUMAN Melanocortin receptor (M1 and M4) Melanocortin receptor 1 (MC1-R) | Melanocortin receptor 1 (MC1R)
Type:
Enzyme
Mol. Mass.:
34717.23
Organism:
Homo sapiens (Human)
Description:
Q01726
Residue:
317
  
Inhibitor
Name:
BDBM230659
Synonyms:
US9340517, 348
Type:
Small organic molecule
Emp. Form.:
C28H43ClN4O2
Mol. Mass.:
503.12
SMILES:
CCC(CC)CN1CC[C@H](CNC(=O)\C=C\c2ccc(Cl)cc2)N[C@H](CCN2CCCCC2)C1=O
: