Target
3-hydroxyacyl-CoA dehydrogenase type-2
Ligand
BDBM232927
Substrate
Meas. Tech.
ABAD Enzymatic Activity Assay
pH
7.3±n/a
Temperature
298.15±n/a K
Ki
70600±n/a nM
IC50
259400±n/a nM
Comments
extracted
Citation
 Yan, SValasani, KR Phosphonate derivatives and methods of use thereof in the treatment of Alzheimer's disease US Patent  US9346839 Publication Date 5/24/2016 
Target
Name:
3-hydroxyacyl-CoA dehydrogenase type-2
Synonyms:
Amyloid Binding Alcohol Dehydrogenase HADH2 HSD17B10 SCHAD XH98G2
Type:
Enyzme
Mol. Mass.:
26924.79
Organism:
Homo sapiens (Human)
Description:
Q99714
Residue:
261
  
Inhibitor
Name:
BDBM232927
Synonyms:
US9346839, 8 | US9738668, Compound 8
Type:
Small organic molecule
Emp. Form.:
C17H19N2O5PS
Mol. Mass.:
394.382
SMILES:
COc1ccc2nc(N[C@@H](c3ccc(O)cc3)P(=O)(OC)OC)sc2c1
: