Target
Urease
Ligand
BDBM174833
Substrate
Meas. Tech.
Urease Inhibition Assay
pH
6.8±0
Temperature
303.15±0 K
IC50
3.795e+4± 1.93e+3 nM
Citation
 Arfan, MAli, MAhmad, HAnis, IKhan, AChoudhary, MIShah, MR Urease inhibitors from Hypericum oblongifolium WALL. J Enzyme Inhib Med Chem 25:296-9 (2010)  
Target
Name:
Urease
Synonyms:
UREA_CANEN | Urea amidohydrolase
Type:
Enzyme
Mol. Mass.:
90746.20
Organism:
Canavalia ensiformis (Jack bean) (Horse bean)
Description:
P07374
Residue:
840
  
Inhibitor
Name:
BDBM174833
Synonyms:
3,4,5-Trihydroxy xanthone (1) | US9114126, MB5
Type:
Small organic molecule
Emp. Form.:
C13H8O5
Mol. Mass.:
244.1996
SMILES:
Oc1ccc2c(oc3c(O)cccc3c2=O)c1O
: