Target
Urease
Ligand
BDBM233115
Substrate
Meas. Tech.
Urease Inhibition Assay
pH
6.8±0
Temperature
303.15±0 K
IC50
2.096e+4± 9.3e+2 nM
Citation
 Arfan, MAli, MAhmad, HAnis, IKhan, AChoudhary, MIShah, MR Urease inhibitors from Hypericum oblongifolium WALL. J Enzyme Inhib Med Chem 25:296-9 (2010)  
Target
Name:
Urease
Synonyms:
UREA_CANEN | Urea amidohydrolase
Type:
Enzyme
Mol. Mass.:
90746.20
Organism:
Canavalia ensiformis (Jack bean) (Horse bean)
Description:
P07374
Residue:
840
  
Inhibitor
Name:
BDBM233115
Synonyms:
Tetracosyl 3-(3,4-dihydroxyphenyl) acrylate (2)
Type:
Small organic molecule
Emp. Form.:
C33H56O4
Mol. Mass.:
516.7953
SMILES:
(=O)C=Cc1ccc(O)c(O)c1
: