Target
Urease
Ligand
BDBM50155446
Substrate
Meas. Tech.
Urease Inhibition Assay
pH
6.8±0
Temperature
303.15±0 K
IC50
1.3843e+5± 1.23e+3 nM
Citation
 Arfan, MAli, MAhmad, HAnis, IKhan, AChoudhary, MIShah, MR Urease inhibitors from Hypericum oblongifolium WALL. J Enzyme Inhib Med Chem 25:296-9 (2010)  
Target
Name:
Urease
Synonyms:
UREA_CANEN | Urea amidohydrolase
Type:
Enzyme
Mol. Mass.:
90746.20
Organism:
Canavalia ensiformis (Jack bean) (Horse bean)
Description:
P07374
Residue:
840
  
Inhibitor
Name:
BDBM50155446
Synonyms:
1,3,7-Trihydroxy xanthone (3) 1,3,7-trihydroxy-9H-xanthen-9-one | CHEMBL361025
Type:
Small organic molecule
Emp. Form.:
C13H8O5
Mol. Mass.:
244.1996
SMILES:
Oc1ccc2oc3cc(O)cc(O)c3c(=O)c2c1
: