Target
Enteropeptidase
Ligand
BDBM234250
Substrate
Meas. Tech.
Inhibition Assay
pH
8±n/a
Ki
0.15±n/a nM
Comments
extracted
Citation
 Suzuki, TKoshiba, TTokumasu, MOhsumi, K Heterocyclic carboxylic acid ester derivative US Patent  US9346821 Publication Date 5/24/2016 
Target
Name:
Enteropeptidase
Synonyms:
ENTK PRSS7 | TMPRSS15
Type:
Enzyme
Mol. Mass.:
112901.62
Organism:
Homo sapiens (Human)
Description:
P98073
Residue:
1019
  
Inhibitor
Name:
BDBM234250
Synonyms:
US9346821, B-20
Type:
Small organic molecule
Emp. Form.:
C21H21FN4O7S2
Mol. Mass.:
524.542
SMILES:
NC(=N)c1ccc(OC(=O)c2ccc(CN3CSC[C@H]3C(=O)N[C@@H](CC(O)=O)C(O)=O)s2)c(F)c1
: