Target
Neuraminidase
Ligand
BDBM4994
Substrate
Meas. Tech.
NA Inhibition Assay
IC50
170±n/a nM
Citation
 Liu, YZhang, LGong, JFang, HLiu, ADu, GXu, W Design, synthesis, and biological activity of thiazole derivatives as novel influenza neuraminidase inhibitors. J Enzyme Inhib Med Chem 26:506-13 (2011)  
Target
Name:
Neuraminidase
Synonyms:
NA Neuraminidase (NA)
Type:
Enzyme
Mol. Mass.:
49917.65
Organism:
Influenza A virus H3N2
Description:
Q67344
Residue:
446
  
Inhibitor
Name:
BDBM4994
Synonyms:
(3R,4R,5S)-5-amino-4-acetamido-3-(pentan-3-yloxy)cyclohex-1-ene-1-carboxylic acid GS4071 | Oseltamivir carboxylate
Type:
Small organic molecule
Emp. Form.:
C14H24N2O4
Mol. Mass.:
284.3514
SMILES:
CCC(CC)O[C@@H]1C=C(C[C@H](N)[C@H]1NC(C)=O)C(O)=O
: