Target
Plasmepsin II
Ligand
BDBM234518
Substrate
Meas. Tech.
Enzyme Inhibition Assay
pH
4.5±n/a
Temperature
298.15±n/a K
IC50
9.64±n/a nM
Comments
extracted
Citation
 Chen, XDing, KMeyers, MJTortorella, MDXu, J Compositions and methods for the treatment of malaria US Patent  US9353089 Publication Date 5/31/2016 
Target
Name:
Plasmepsin II
Synonyms:
Aspartic hemoglobinase II PLM2_PLAFX Plasmepsin 2 Plasmepsin-II
Type:
Enzyme
Mol. Mass.:
51482.09
Organism:
Plasmodium falciparum
Description:
P46925
Residue:
453
  
Inhibitor
Name:
BDBM234518
Synonyms:
US9353089, 172
Type:
Small organic molecule
Emp. Form.:
C27H28N4O2
Mol. Mass.:
440.5368
SMILES:
COc1ccc(cc1)C1(NC(=N)N(C2CCCCC2)C1=O)c1cccc(c1)-c1ccncc1
: