Target
Proto-oncogene tyrosine-protein kinase Src [251-533,T338C]
Ligand
BDBM234844
Substrate
Meas. Tech.
In vitro Kinase Assay
pH
8±n/a
IC50
338±n/a nM
Comments
extracted
Citation
 Garske, ALShokat, KM Methods and compositions for kinase inhibition US Patent  US9353116 Publication Date 5/31/2016 
Target
Name:
Proto-oncogene tyrosine-protein kinase Src [251-533,T338C]
Synonyms:
Proto-oncogene tyrosine-protein kinase Src (T338C) SRC_CHICK
Type:
Protein
Mol. Mass.:
32362.46
Organism:
Gallus gallus (Chicken)
Description:
residues 251-533
Residue:
283
  
Inhibitor
Name:
BDBM234844
Synonyms:
US9353116, 13
Type:
Small organic molecule
Emp. Form.:
C17H18FN5O
Mol. Mass.:
327.3561
SMILES:
CC(C)n1nc(Cc2cccc(c2)C(=O)CF)c2c(N)ncnc12
: