Target
Proto-oncogene tyrosine-protein kinase Src [251-533,T338C]
Ligand
BDBM234857
Substrate
Meas. Tech.
In vitro Kinase Assay
pH
8±n/a
IC50
618±n/a nM
Comments
extracted
Citation
 Garske, ALShokat, KM Methods and compositions for kinase inhibition US Patent  US9353116 Publication Date 5/31/2016 
Target
Name:
Proto-oncogene tyrosine-protein kinase Src [251-533,T338C]
Synonyms:
Proto-oncogene tyrosine-protein kinase Src (T338C) SRC_CHICK
Type:
Protein
Mol. Mass.:
32362.46
Organism:
Gallus gallus (Chicken)
Description:
residues 251-533
Residue:
283
  
Inhibitor
Name:
BDBM234857
Synonyms:
US9353116, 16
Type:
Small organic molecule
Emp. Form.:
C18H22N6O2S
Mol. Mass.:
386.471
SMILES:
CC(C)(C)n1nc(Cc2cccc(NS(=O)(=O)C=C)c2)c2c(N)ncnc12
: