Target
Carbonic anhydrase 1
Ligand
BDBM235670
Substrate
Meas. Tech.
CA Enzyme Assay
pH
10±n/a
IC50
4.250e+6±n/a nM
Comments
extracted
Citation
 Gökçe, BGençer, NArslan, OTurkoglu, SAAlper, MKöçkar, F Evaluation of in vitro effects of some analgesic drugs on erythrocyte and recombinant carbonic anhydrase I and II. J Enzyme Inhib Med Chem 27:37-42 (2012)  
Target
Name:
Carbonic anhydrase 1
Synonyms:
CA-I CAB Carbonate dehydratase I Carbonic anhydrase 1 (CA I) Carbonic anhydrase 1 (Recombinant CA I) Carbonic anhydrase B Carbonic anhydrase I (CA I) Carbonic anhydrase I (CAI) Carbonic anhydrase isoenzyme I (hCA I) | hCA
Type:
Enzyme
Mol. Mass.:
28873.37
Organism:
Homo sapiens (Human)
Description:
P00915
Residue:
261
  
Inhibitor
Name:
BDBM235670
Synonyms:
Dexamethasone sodium phosphate
Type:
Small organic molecule
Emp. Form.:
C22H28FO8P
Mol. Mass.:
470.4262
SMILES:
C[C@@H]1C[C@H]2[C@@H]3CCC4=CC(=O)C=C[C@]4(C)[C@@]3(F)[C@@H](O)C[C@]2(C)[C@@]1(O)C(=O)COP([O-])([O-])=O
: