Target
Carbonic anhydrase 2
Ligand
BDBM235671
Substrate
Meas. Tech.
CA Enzyme Assay
pH
10±n/a
IC50
3.56e+5±n/a nM
Comments
extracted
Citation
 Gökçe, BGençer, NArslan, OTurkoglu, SAAlper, MKöçkar, F Evaluation of in vitro effects of some analgesic drugs on erythrocyte and recombinant carbonic anhydrase I and II. J Enzyme Inhib Med Chem 27:37-42 (2012)  
Target
Name:
Carbonic anhydrase 2
Synonyms:
CA-II CAC Carbonate dehydratase II Carbonic anhydrase 2 (CA-II) Carbonic anhydrase C Carbonic anhydrase II (CA-II) Carbonic anhydrase II (hCA II) | Carbonic anhydrase isoenzyme II (hCA II)
Type:
Enzyme
Mol. Mass.:
29250.71
Organism:
Homo sapiens (Human)
Description:
P00918
Residue:
260
  
Inhibitor
Name:
BDBM235671
Synonyms:
Metamizol sodium
Type:
Small organic molecule
Emp. Form.:
C13H17N3O4S
Mol. Mass.:
311.357
SMILES:
CN(CS(O)(=O)=O)c1c(C)n(C)n(-c2ccccc2)c1=O
: