Target
5-hydroxytryptamine receptor 2A/MAP kinase-activated protein kinase 2
Ligand
BDBM235961
Substrate
Meas. Tech.
Inhibition Assay
pH
7.5±n/a
Temperature
298.15±n/a K
IC50
6.4±n/a nM
Comments
extracted
Citation
 Selness, SRMonahan, JBSchindler, JFDevadas, B Substituted pyridinone-pyridinyl compounds US Patent  US9365546 Publication Date 6/14/2016 
Target
Name:
5-hydroxytryptamine receptor 2A/MAP kinase-activated protein kinase 2
Synonyms:
p38 MAPK/ MAPKAP kinases MK2 | p38 MAPK/ MAPKAP kinases PRAK
Type:
Protein
Mol. Mass.:
Description:
Components:
This complex has 2 components.
Component 1
Name:
5-hydroxytryptamine receptor 2A
Synonyms:
5-HT-2 5-HT2A 5-hydroxytryptamine receptor 2A (5HT-2A) 5HT2A_HUMAN HTR2A | Serotonin receptor 2A
Type:
undefined
Mol. Mass.:
52607.65
Organism:
Homo sapiens (Human)
Description:
P28223
Residue:
471
  
Component 2
Name:
MAP kinase-activated protein kinase 2
Synonyms:
MAP kinase-activated protein kinase 2 (MAPKAPK2) MAP kinase-activated protein kinase 2 (p38/MK2) MAPK-activated protein kinase 2 MAPKAP kinase 2 MAPKAPK2 | MK2
Type:
Serine/threonine-protein kinase
Mol. Mass.:
45579.87
Organism:
Homo sapiens (Human)
Description:
P49137
Residue:
400
  
Inhibitor
Name:
BDBM235961
Synonyms:
US9365546, 284
Type:
Small organic molecule
Emp. Form.:
C26H23ClF2N4O3
Mol. Mass.:
512.936
SMILES:
Cc1cnc(cc1-n1c(C)cc(OCc2ccc(F)cc2F)c(Cl)c1=O)-c1ccnc(n1)C(C)(C)O
: