Target
Nuclear receptor ROR-gamma
Ligand
BDBM293041
Substrate
Meas. Tech.
transient transactivation assay
IC50
<100±n/a nM
Citation
 Argiriadi, MABreinlinger, ECCusack, KPHobson, ADPotin, DBarth, MAmaudrut, JPoupardin, OMounier, LKort, ME Nuclear receptor modulators US Patent  US10106501 Publication Date 10/23/2018 
Target
Name:
Nuclear receptor ROR-gamma
Synonyms:
NR1F3 Nuclear receptor ROR-gamma (RORC) RAR-related orphan receptor C (RORc) RORG RZRG Retinoid-related orphan receptor-gamma (RORc)
Type:
Enzyme Catalytic Domain
Mol. Mass.:
58218.40
Organism:
Homo sapiens (Human)
Description:
P51449
Residue:
518
  
Inhibitor
Name:
BDBM293041
Synonyms:
US10106501, Example AA-28
Type:
Small organic molecule
Emp. Form.:
C27H27Cl2N3O2
Mol. Mass.:
496.428
SMILES:
Cc1cc(cc2n(C)c(Cc3c(Cl)ccc(C(=O)N4CCC(CC4)C4COC4)c3Cl)cc12)C#N
: