Target
Nuclear receptor ROR-gamma
Ligand
BDBM293077
Substrate
Meas. Tech.
transient transactivation assay
IC50
<100±n/a nM
Citation
 Argiriadi, MABreinlinger, ECCusack, KPHobson, ADPotin, DBarth, MAmaudrut, JPoupardin, OMounier, LKort, ME Nuclear receptor modulators US Patent  US10106501 Publication Date 10/23/2018 
Target
Name:
Nuclear receptor ROR-gamma
Synonyms:
NR1F3 Nuclear receptor ROR-gamma (RORC) RAR-related orphan receptor C (RORc) RORG RZRG Retinoid-related orphan receptor-gamma (RORc)
Type:
Enzyme Catalytic Domain
Mol. Mass.:
58218.40
Organism:
Homo sapiens (Human)
Description:
P51449
Residue:
518
  
Inhibitor
Name:
BDBM293077
Synonyms:
US10106501, Example AN-4
Type:
Small organic molecule
Emp. Form.:
C27H27Cl2N3O3
Mol. Mass.:
512.428
SMILES:
COCCC1CCN(CC1)C(=O)c1ccc(Cl)c(C(=O)c2cc3c(C)cc(cc3n2C)C#N)c1Cl
: