Target
Carbonic anhydrase 3
Ligand
BDBM7460
Substrate
Meas. Tech.
Esterase Activity Assay
pH
7.4±n/a
Ki
9100±n/a nM
Comments
extracted
Citation
 Ekinci, DKaragoz, LEkinci, DSenturk, MSupuran, CT Carbonic anhydrase inhibitors: in vitro inhibition of a isoforms (hCA I, hCA II, bCA III, hCA IV) by flavonoids. J Enzyme Inhib Med Chem 28:283-8 (2013)  
Target
Name:
Carbonic anhydrase 3
Synonyms:
CA-III CAH3_BOVIN Carbonic anhydrase 3 Carbonic anhydrase III
Type:
Enzyme
Mol. Mass.:
29376.92
Organism:
Bos taurus (Cattle)
Description:
Q3SZX4
Residue:
260
  
Inhibitor
Name:
BDBM7460
Synonyms:
2-(3,4-dihydroxyphenyl)-3,5,7-trihydroxy-4H-chromen-4-one 2-(3,4-dihydroxyphenyl)-3,5,7-trihydroxy-chromone;hydrate Quercetin Quercetin (21) US11021454, Compound Quercetin med.21724, Compound 4
Type:
Small organic molecule
Emp. Form.:
C15H10O7
Mol. Mass.:
302.2357
SMILES:
Oc1cc(O)c2c(c1)oc(-c1ccc(O)c(O)c1)c(O)c2=O
: