Target
Histamine H1 receptor
Ligand
BDBM293411
Substrate
Meas. Tech.
BIOLOGICAL ASSAY
pH
7.4±n/a
Temperature
298.15±n/a K
IC50
424±n/a nM
Comments
extracted
Citation
 Rodes Solanes, ROlivera Tizne, RHernández Herrero, GRubio Royo, VLedo Gómez, F Benzimidazole derivatives as antihistamine agents US Patent  US10106522 Publication Date 10/23/2018 
Target
Name:
Histamine H1 receptor
Synonyms:
H1R HISTAMINE H1 HRH1_HUMAN
Type:
G Protein-Coupled Receptor (GPCR)
Mol. Mass.:
55808.72
Organism:
Homo sapiens (Human)
Description:
Cell pellets from SK-N-MC cells transfected with human H1 receptor were used in binding assay.
Residue:
487
  
Inhibitor
Name:
BDBM293411
Synonyms:
US10106522, Example 5 in EP 0580541
Type:
Small organic molecule
Emp. Form.:
C28H39N3O
Mol. Mass.:
433.6288
SMILES:
CCOCCn1c(nc2ccccc12)C1CCN(CCc2ccc(cc2)C(C)(C)C)CC1
: