Target
Epidermal growth factor receptor [668-1210,T790M,L858R]
Ligand
BDBM238270
Substrate
Meas. Tech.
Cell Assay
EC50
55±n/a nM
Citation
 Lee, KNiu, DBaevsky, MF Mutant-selective EGFR inhibitors and uses thereof US Patent  US9409887 Publication Date 8/9/2016 
Target
Name:
Epidermal growth factor receptor [668-1210,T790M,L858R]
Synonyms:
EGFR ERBB Epidermal growth factor receptor (EGFR)(T790M/L858R) | HER1
Type:
Enzyme
Mol. Mass.:
61378.18
Organism:
Homo sapiens (Human)
Description:
a.a: 668-1210
Residue:
543
  
Inhibitor
Name:
BDBM238270
Synonyms:
US9409887, I-1
Type:
Small organic molecule
Emp. Form.:
C26H27F4N7O2
Mol. Mass.:
545.5319
SMILES:
COc1cc(NC2CN(CCF)C2)ccc1Nc1ncc(c(Nc2cccc(NC(=O)C=C)c2)n1)C(F)(F)F
: