Target
Serine protease 1
Ligand
BDBM50286441
Substrate
Meas. Tech.
Tyrpsin Amidolytic Assay
pH
7.5±n/a
Ki
8.0±0.7 nM
Comments
extracted
Citation
 Markowska, ABruzgo, MSurazynski, AMidura-Nowaczek, K Tripeptides with non-code amino acids as potential serine proteases inhibitors. J Enzyme Inhib Med Chem 28:639-43 (2013)  
Target
Name:
Serine protease 1
Synonyms:
Alpha-trypsin chain 1 Beta-trypsin PRSS1 TRP1 TRY1_HUMAN Thrombin & trypsin Trypsin I | Trypsin-1
Type:
Enzyme
Mol. Mass.:
26557.80
Organism:
Homo sapiens (Human)
Description:
P07477
Residue:
247
  
Inhibitor
Name:
BDBM50286441
Synonyms:
(S)-2-((S)-2-Acetylamino-4-(S)-methyl-pentanoylamino)-4-methyl-pentanoic acid (1-formyl-4-guanidino-butyl)-amide (S)-2-Acetylamino-4-methyl-pentanoic acid [(S)-1-((S)-1-formyl-4-guanidino-butylcarbamoyl)-3-methyl-butyl]-amide (S)-2-acetylamino-4-methyl-pentanoic acid [(S)-2-(1-formyl-4-guanidino-butylamino)-4-methyl-pentanoyl]-amide Ac-LLR-CHO CHEMBL129157
Type:
Small organic molecule
Emp. Form.:
C20H38N6O5
Mol. Mass.:
442.5529
SMILES:
CC(C)C[C@H](NC(C)=O)C(=O)N[C@@H](CC(C)C)C(=O)N[C@@H](CCCNC(N)=N)C(O)=O
: