Target
Atypical chemokine receptor 3
Ligand
BDBM243790
Substrate
Meas. Tech.
In Vitro Assay
Temperature
310.15±n/a K
EC50
0.9±n/a nM
Comments
extracted
Citation
 Fretz, HGude, MGuerry, PKimmerlin, TLehembre, FPfeifer, TValdenaire, A 1-[m-carboxamido(hetero)aryl-methyl]-heterocyclyl-carboxamide derivatives US Patent  US9428456 Publication Date 8/30/2016 
Target
Name:
Atypical chemokine receptor 3
Synonyms:
ACKR3 C-X-C chemokine receptor type 7 CMKOR1 CXCR-7 Chemokine orphan receptor 1 G-protein coupled receptor RDC1 homolog RDC-1 | RDC1
Type:
Enzyme
Mol. Mass.:
41498.84
Organism:
Homo sapiens (Human)
Description:
P25106
Residue:
362
  
Inhibitor
Name:
BDBM243790
Synonyms:
US9428456, 1.219
Type:
Small organic molecule
Emp. Form.:
C25H29ClFN3O2
Mol. Mass.:
457.968
SMILES:
Fc1ccc(cc1)C(=O)Nc1ccc(Cl)c(CN2CCC(CC2)C(=O)NC2CCCC2)c1
: