Target
P2Y purinoceptor 1
Ligand
BDBM245383
Substrate
Meas. Tech.
Scintillation Proximity Assay (SPA)
pH
7.4±n/a
Temperature
298.15±n/a K
Ki
1.2±n/a nM
Comments
extracted
Citation
 Thibeault, CClark, CGDeLucca, IHu, CHJeon, YLam, PYQiao, JXYang, WWang, YWang, TC 7-hydroxy-spiropipiperidine indolinyl antagonists of P2Y1 receptor US Patent  US9428504 Publication Date 8/30/2016 
Target
Name:
P2Y purinoceptor 1
Synonyms:
ATP receptor P2RY1_HUMAN P2Y1 Purinergic receptor P2Y1
Type:
Enzyme
Mol. Mass.:
42090.25
Organism:
Homo sapiens (Human)
Description:
P47900
Residue:
373
  
Inhibitor
Name:
BDBM245383
Synonyms:
US9428504, 133
Type:
Small organic molecule
Emp. Form.:
C38H36ClFN6O2S2
Mol. Mass.:
727.313
SMILES:
CC(C)(C)CN1CCC2(CN(c3c2c(ccc3O)-c2nc3cc(Cl)ccc3s2)c2ccccc2NC(=O)Nc2nc3ccc(F)cc3s2)CC1
: