Target
Dual specificity tyrosine-phosphorylation-regulated kinase 1B
Ligand
BDBM50434364
Substrate
Meas. Tech.
HotSpot Technology Assay
pH
7.5±n/a
Temperature
298.15±n/a K
IC50
2.83±n/a nM
Comments
extracted
Citation
 Leblond, BCasagrande, ADesire, LFoucourt, ABesson, T DYRK1 inhibitors and uses thereof US Patent  US9446044 Publication Date 9/20/2016 
Target
Name:
Dual specificity tyrosine-phosphorylation-regulated kinase 1B
Synonyms:
DYR1B_HUMAN Dual specificity tyrosine-phosphorylation-regulated kinase 1B MIRK
Type:
Enzyme
Mol. Mass.:
69222.24
Organism:
Homo sapiens (Human)
Description:
Q9Y463
Residue:
629
  
Inhibitor
Name:
BDBM50434364
Synonyms:
CHEMBL2386764 | US9446044, 65
Type:
Small organic molecule
Emp. Form.:
C18H15N5OS
Mol. Mass.:
349.41
SMILES:
COC(=N)c1nc2ccc3ncnc(Nc4ccc(C)cc4)c3c2s1
: