Target
Dual specificity tyrosine-phosphorylation-regulated kinase 1B
Ligand
BDBM246383
Substrate
Meas. Tech.
HotSpot Technology Assay
pH
7.5±n/a
Temperature
298.15±n/a K
IC50
0.59±n/a nM
Comments
extracted
Citation
 Leblond, BCasagrande, ADesire, LFoucourt, ABesson, T DYRK1 inhibitors and uses thereof US Patent  US9446044 Publication Date 9/20/2016 
Target
Name:
Dual specificity tyrosine-phosphorylation-regulated kinase 1B
Synonyms:
DYR1B_HUMAN Dual specificity tyrosine-phosphorylation-regulated kinase 1B MIRK
Type:
Enzyme
Mol. Mass.:
69222.24
Organism:
Homo sapiens (Human)
Description:
Q9Y463
Residue:
629
  
Inhibitor
Name:
BDBM246383
Synonyms:
US9446044, 69
Type:
Small organic molecule
Emp. Form.:
C18H14FN5O2S
Mol. Mass.:
383.399
SMILES:
COC(=N)c1nc2ccc3ncnc(Nc4ccc(OC)cc4F)c3c2s1
: