Target
Serine/threonine-protein kinase pim-3
Ligand
BDBM248978
Substrate
Meas. Tech.
Kinase Binding Assay
pH
7.2±n/a
Temperature
298.15±n/a K
Ki
0.011±n/a nM
Comments
extracted
Citation
 Do, SHu, HKolesnikov, ATsui, VHWang, X 5-azaindazole compounds and methods of use US Patent  US9434725 Publication Date 9/6/2016 
Target
Name:
Serine/threonine-protein kinase pim-3
Synonyms:
PIM3 Serine/threonine-protein kinase pim-3 (PIM3)
Type:
Protein
Mol. Mass.:
35888.19
Organism:
Homo sapiens (Human)
Description:
Q86V86
Residue:
326
  
Inhibitor
Name:
BDBM248978
Synonyms:
US9434725, 209
Type:
Small organic molecule
Emp. Form.:
C21H23N9
Mol. Mass.:
401.4676
SMILES:
Cc1nc(cnc1N)-c1cc2n(ncc2cn1)-c1cccc(n1)N1CCC[C@H](N)C1
: