Target
Hexokinase-4
Ligand
BDBM249124
Substrate
Meas. Tech.
Glucokinase-Activating Assay
Temperature
303.15±n/a K
EC50
1.9±n/a nM
Comments
extracted
Citation
 Lin, SZhang, RCampbell, BDewnani, SVXu, JXu, LParmee, ERKats-Kagan, R Glucokinase activator compounds, compositions containing such compounds, and methods of treatment US Patent  US9453038 Publication Date 9/27/2016 
Target
Name:
Hexokinase-4
Synonyms:
GCK Glucokinase (GK) HK IV HXK4_HUMAN Hexokinase-D
Type:
Enzyme
Mol. Mass.:
52175.81
Organism:
Homo sapiens (Human)
Description:
P35557
Residue:
465
  
Inhibitor
Name:
BDBM249124
Synonyms:
US9453038, 1
Type:
Small organic molecule
Emp. Form.:
C30H31N3O6S
Mol. Mass.:
561.649
SMILES:
CCS(=O)(=O)c1ccc(Oc2cc3cc([nH]c3cc2C2CCC(=O)N2C)-c2ccc(CCC(=O)OC)cn2)cc1
: