Target
Lysophosphatidic acid receptor 5
Ligand
BDBM251692
Substrate
Meas. Tech.
Receptor Assay
Temperature
310.15±n/a K
IC50
45±n/a nM
Comments
extracted
Citation
 Buffham, WCanning, HDavenport, RFarnaby, WMack, SParmar, AWright, S Compounds US Patent  US9464060 Publication Date 10/11/2016 
Target
Name:
Lysophosphatidic acid receptor 5
Synonyms:
GPR92 LPAR5 Lysophosphatidic acid receptor 5 | Lysophosphatidic acid receptor 5 (LPA5)
Type:
Enzyme
Mol. Mass.:
41372.36
Organism:
Homo sapiens (Human)
Description:
Q9H1C0
Residue:
372
  
Inhibitor
Name:
BDBM251692
Synonyms:
US10100018, Example 28 | US9464060, 28
Type:
Small organic molecule
Emp. Form.:
C24H23NO5
Mol. Mass.:
405.4431
SMILES:
CCN(Cc1ccc(cc1)C(O)=O)C(=O)c1ccc(Oc2ccccc2OC)cc1
: