Target
5-hydroxytryptamine receptor 2C
Ligand
BDBM255474
Substrate
Meas. Tech.
Scintillation Proximity Assay
Temperature
298.15±n/a K
Ki
137±n/a nM
Comments
extracted
Citation
 Ledgard, AJ (Thieno[2,3-b][1,5]benzoxazepin-4-yl)piperazin-1-yl compounds as dual activity H1 inverse agonists/5-HT2A antagonists US Patent  US9481688 Publication Date 11/1/2016 
Target
Name:
5-hydroxytryptamine receptor 2C
Synonyms:
5-HT-1C 5-HT1C 5-HT2C-INI 5-HTR2C 5-hydroxytryptamine receptor 2C (5-HT-2C) 5HT-1C HTR1C Serotonin (5-HT3) receptor Serotonin Receptor 2C
Type:
G Protein-Coupled Receptor (GPCR)
Mol. Mass.:
51836.79
Organism:
Homo sapiens (Human)
Description:
P28335
Residue:
458
  
Inhibitor
Name:
BDBM255474
Synonyms:
US9481688, 1 | US9481688, 3
Type:
Small organic molecule
Emp. Form.:
C21H24ClN3O3S
Mol. Mass.:
433.952
SMILES:
Cc1ccc2N=C(N3CCN(CC(C)(C)C(O)=O)CC3)c3cc(Cl)sc3Oc2c1
: