Target
5-hydroxytryptamine receptor 7
Ligand
BDBM255474
Substrate
Meas. Tech.
Binding Assay or Functional Activity Assay
Ki
>2060±n/a nM
Citation
 Ledgard, AJ (Thieno[2,3-b][1,5]benzoxazepin-4-yl)piperazin-1-yl compounds as dual activity H1 inverse agonists/5-HT2A antagonists US Patent  US9481688 Publication Date 11/1/2016 
Target
Name:
5-hydroxytryptamine receptor 7
Synonyms:
5-HT-7 5-HT7 5-HT7S 5HT7 HTR7 | Serotonin receptor 7
Type:
G Protein-Coupled Receptor (GPCR)
Mol. Mass.:
53573.08
Organism:
Homo sapiens (Human)
Description:
P34969
Residue:
479
  
Inhibitor
Name:
BDBM255474
Synonyms:
US9481688, 1 | US9481688, 3
Type:
Small organic molecule
Emp. Form.:
C21H24ClN3O3S
Mol. Mass.:
433.952
SMILES:
Cc1ccc2N=C(N3CCN(CC(C)(C)C(O)=O)CC3)c3cc(Cl)sc3Oc2c1
: