Target
chymase
Ligand
BDBM255886
Substrate
Meas. Tech.
Enzymatic Chymase Assay
pH
7.5±n/a
IC50
4±n/a nM
Comments
extracted
Citation
 Fürstner, CAckerstaff, JStraub, AMeier, HTinel, HZimmermann, KTersteegen, AZubov, DKast, RSchamberger, JSchäfer, MBörngen, K Bicyclically substituted uracils and the use thereof US Patent  US9481672 Publication Date 11/1/2016 
Target
Name:
chymase
Synonyms:
Type:
Enzyme
Mol. Mass.:
27507.42
Organism:
Mesocricetus auratus (Golden hamster)
Description:
A0A1U7QTH6
Residue:
247
  
Inhibitor
Name:
BDBM255886
Synonyms:
US9481672, 33
Type:
Small organic molecule
Emp. Form.:
C28H27F3N4O5
Mol. Mass.:
556.533
SMILES:
CCOC(=O)c1cn(-c2ccc3n(C)c(=O)n(C4CCC4)c3c2)c(=O)n(Cc2cccc(c2C)C(F)(F)F)c1=O
: