Target
Beta-secretase 2
Ligand
BDBM258892
Substrate
Meas. Tech.
Time-Resolved Endpoint Proteolysis Assay
pH
5±n/a
Temperature
303.15±n/a K
Ki
<10±n/a nM
Comments
extracted
Citation
 Wu, WBurnett, DAStamford, AWCumming, JNBennett, CEGilbert, EJScott, JDYu, YPeng, X 5-substituted iminothiazines and their mono- and dioxides as BACE inhibitors, compositions, and their use US Patent  US9499502 Publication Date 11/22/2016 
Target
Name:
Beta-secretase 2
Synonyms:
AEPLC ASP1 Asp 1 Aspartyl protease 1 BACE2_HUMAN Beta-secretase (BACE) Beta-secretase 2 (BACE-2) Beta-site APP-cleaving enzyme 2 Memapsin-1 beta-Secretase (BACE-2)
Type:
Protein
Mol. Mass.:
56171.20
Organism:
Homo sapiens (Human)
Description:
Q9Y5Z0
Residue:
518
  
Inhibitor
Name:
BDBM258892
Synonyms:
US9499502, 2
Type:
Small organic molecule
Emp. Form.:
C19H19F3N4O3S
Mol. Mass.:
440.439
SMILES:
C[C@]1(CS(=O)(=O)C(C)(C)C(=N)N1)c1cc(NC(=O)c2ncc(F)cc2F)ccc1F
: