Target
Hepatocyte growth factor receptor
Ligand
BDBM50182492
Substrate
Meas. Tech.
Inhibition Assay
Temperature
293.15±n/a K
IC50
12±n/a nM
Comments
extracted
Citation
 Zhao, ZWang, HWu, CQi, Q [1,2,4] triazol [4,3-A] pyridine derivative, preparation method therefor or medical application thereof US Patent  US9512121 Publication Date 12/6/2016 
Target
Name:
Hepatocyte growth factor receptor
Synonyms:
Hepatocyte growth factor receptor Hepatocyte growth factor receptor (c-MET) MET Met proto-oncogene (hepatocyte growth factor receptor) Tyrosine-protein kinase Met (c-Met) c-Met kinase
Type:
Protein
Mol. Mass.:
155559.73
Organism:
Homo sapiens (Human)
Description:
P08581
Residue:
1390
  
Inhibitor
Name:
BDBM50182492
Synonyms:
CHEMBL3818387 | US9512121, 16
Type:
Small organic molecule
Emp. Form.:
C22H17N7O2S
Mol. Mass.:
443.481
SMILES:
CN1C(=O)COc2c1cnc1ccc(Sc3nnc4ccc(cn34)-c3cnn(C)c3)cc21
: