Target
Hepatocyte growth factor receptor
Ligand
BDBM50182518
Substrate
Meas. Tech.
Inhibition Assay
Temperature
293.15±n/a K
IC50
7.9±n/a nM
Comments
extracted
Citation
 Zhao, ZWang, HWu, CQi, Q [1,2,4] triazol [4,3-A] pyridine derivative, preparation method therefor or medical application thereof US Patent  US9512121 Publication Date 12/6/2016 
Target
Name:
Hepatocyte growth factor receptor
Synonyms:
Hepatocyte growth factor receptor Hepatocyte growth factor receptor (c-MET) MET Met proto-oncogene (hepatocyte growth factor receptor) Tyrosine-protein kinase Met (c-Met) c-Met kinase
Type:
Protein
Mol. Mass.:
155559.73
Organism:
Homo sapiens (Human)
Description:
P08581
Residue:
1390
  
Inhibitor
Name:
BDBM50182518
Synonyms:
CHEMBL3819436 | US9512121, 19
Type:
Small organic molecule
Emp. Form.:
C21H14FN7O2S
Mol. Mass.:
447.445
SMILES:
Cn1cc(cn1)-c1cc(F)c2nnc(Sc3ccc4ncc5NC(=O)COc5c4c3)n2c1
: