Target
Phosphatidylinositol 3,4,5-trisphosphate 5-phosphatase 2
Ligand
BDBM50054271
Substrate
Meas. Tech.
Inhibition Assay
pH
7±n/a
IC50
10700±2400 nM
Comments
extracted
Citation
 Zhang, ZZeng, L Hydroxyindole carboxylic acid based inhibitors for oncogenic Src homology-2 domain containing protein tyrosine phosphatase-2 (SHP2) US Patent  US9522881 Publication Date 12/20/2016 
Target
Name:
Phosphatidylinositol 3,4,5-trisphosphate 5-phosphatase 2
Synonyms:
INPPL-1 Inositol polyphosphate phosphatase-like protein 1 Protein 51C SHIP-2 SHIP2_HUMAN | Src homology-2 domain containing protein tyrosine phosphatase-2 (SHP2)
Type:
Enzyme
Mol. Mass.:
138596.65
Organism:
Homo sapiens (Human)
Description:
O15357
Residue:
1258
  
Inhibitor
Name:
BDBM50054271
Synonyms:
CHEMBL3319390 | US9522881, 11c-8 (L88N25)
Type:
Small organic molecule
Emp. Form.:
C29H28IN3O5
Mol. Mass.:
625.4542
SMILES:
CC(C)c1ccc(NC(=O)CCC(=O)Nc2cccc(c2)-c2c(I)c3cc(C(O)=O)c(O)cc3n2C)cc1
: