Target
Tyrosine-protein kinase ABL1 [T315I]
Ligand
BDBM260153
Substrate
Meas. Tech.
Enzyme Assay
IC50
<20±n/a nM
Citation
 Chilov, GGTitov, IY Protein kinase inhibitors (variants), use thereof in treating oncological diseases and a pharmaceutical composition based thereon US Patent  US9522910 Publication Date 12/20/2016 
Target
Name:
Tyrosine-protein kinase ABL1 [T315I]
Synonyms:
ABL ABL1 Abelson murine leukemia viral oncogene homolog 1 Proto-oncogene c-Abl Tyrosine-protein kinase ABL (T315I) c-ABL p150
Type:
Mol. Mass.:
122909.35
Organism:
Homo sapiens (Human)
Description:
P00519 (T315I)
Residue:
1130
  
Inhibitor
Name:
BDBM260153
Synonyms:
US9522910, Table 1 Compound 3: 3-{2-[2-methyl-5-({4-[(4-methylpiperazin-1-yl)methyl]-3-(trifluoromethyl)phenyl}carbamoyl)phenyl]ethynyl}-[1,2,4]triazolo[4,3-a]pyridine-7-carboxylic acid
Type:
Small organic molecule
Emp. Form.:
C30H27F3N6O3
Mol. Mass.:
576.569
SMILES:
CN1CCN(Cc2ccc(NC(=O)c3ccc(C)c(c3)C#Cc3nnc4cc(ccn34)C(O)=O)cc2C(F)(F)F)CC1
: