Target
Lysine-specific demethylase 5A
Ligand
BDBM277714
Substrate
Meas. Tech.
Jarid1A Assay
IC50
<100±n/a nM
Citation
 Kanouni, TStafford, JAVeal, JMWallace, MB Histone demethylase inhibitors US Patent  US10336727 Publication Date 7/2/2019 
Target
Name:
Lysine-specific demethylase 5A
Synonyms:
Histone demethylase JARID1A Jumonji/ARID domain-containing protein 1A KDM5A_HUMAN RBBP-2 RBP2 | Retinoblastoma-binding protein 2
Type:
Protein
Mol. Mass.:
192091.79
Organism:
Homo sapiens (Human)
Description:
P29375
Residue:
1690
  
Inhibitor
Name:
BDBM277714
Synonyms:
3-[(1-{2-[2-(dimethylamino)ethoxy]ethyl}-1H-indazol-3-yl)amino]pyridine-4-carboxylic acid US10336727, Example 11 | US9617242, Example 11
Type:
Small organic molecule
Emp. Form.:
C19H23N5O3
Mol. Mass.:
369.4176
SMILES:
CN(C)CCOCCn1nc(Nc2cnccc2C(O)=O)c2ccccc12
: