Target
Aurora kinase A
Ligand
BDBM50073545
Substrate
Meas. Tech.
Inhibition Assay
IC50
<100±n/a nM
Citation
 Sampson, PBLiu, YLi, SForrest, BTPauls, HWEdwards, LGFeher, MPatel, NKLaufer, R Kinase inhibitors and method of treating cancer US Patent  US10358436 Publication Date 7/23/2019 
Target
Name:
Aurora kinase A
Synonyms:
AIK ARK-1 AURA AURKA_HUMAN Aurora 2 Aurora kinase A (AURKA) Aurora kinase A (Aurora-2) Aurora/IPL1-related kinase 1 Breast tumor-amplified kinase IAK1 STK15 GN Serine/threonine kinase 15 Serine/threonine-protein kinase 6 Serine/threonine-protein kinase aurora-A aurora-2 | hARK1
Type:
Serine/threonine-protein kinase
Mol. Mass.:
45830.98
Organism:
Homo sapiens (Human)
Description:
O14965
Residue:
403
  
Inhibitor
Name:
BDBM50073545
Synonyms:
CHEMBL3408949 US9907800, Example A151
Type:
Small organic molecule
Emp. Form.:
C30H28N4O2
Mol. Mass.:
476.5689
SMILES:
O=C1Nc2ccccc2[C@]11C[C@H]1c1ccc2c(\C=C\c3cccc(CN4CCOCC4)c3)n[nH]c2c1
: