Target
Aurora kinase B
Ligand
BDBM50073545
Substrate
Meas. Tech.
Inhibition Assay
IC50
<100±n/a nM
Citation
 Sampson, PBLiu, YLi, SForrest, BTPauls, HWEdwards, LGFeher, MPatel, NKLaufer, R Kinase inhibitors and method of treating cancer US Patent  US10358436 Publication Date 7/23/2019 
Target
Name:
Aurora kinase B
Synonyms:
AIK2 AIM1 ARK2 AURKB_HUMAN Aurora B-INCENP Aurora kinase B (AURKB) STK-1 STK12 Serine/threonine-protein kinase aurora B
Type:
Protein
Mol. Mass.:
39327.72
Organism:
Homo sapiens (Human)
Description:
Q96GD4
Residue:
344
  
Inhibitor
Name:
BDBM50073545
Synonyms:
CHEMBL3408949 US9907800, Example A151
Type:
Small organic molecule
Emp. Form.:
C30H28N4O2
Mol. Mass.:
476.5689
SMILES:
O=C1Nc2ccccc2[C@]11C[C@H]1c1ccc2c(\C=C\c3cccc(CN4CCOCC4)c3)n[nH]c2c1
: