Target
Serine/threonine-protein kinase PLK4 [1-391]
Ligand
BDBM50044658
Substrate
Meas. Tech.
Inhibition Assay
IC50
<100±n/a nM
Citation
 Sampson, PBLiu, YLi, SForrest, BTPauls, HWEdwards, LGFeher, MPatel, NKLaufer, R Kinase inhibitors and method of treating cancer US Patent  US10358436 Publication Date 7/23/2019 
Target
Name:
Serine/threonine-protein kinase PLK4 [1-391]
Synonyms:
PLK4 SAK Serine/threonine-protein kinase PLK4
Type:
Protein
Mol. Mass.:
43940.49
Organism:
Homo sapiens (Human)
Description:
aa 1-391
Residue:
391
  
Inhibitor
Name:
BDBM50044658
Synonyms:
CHEMBL3353344 | US10358436, Example A158
Type:
Small organic molecule
Emp. Form.:
C26H22N4O
Mol. Mass.:
406.4791
SMILES:
Cc1ccc(\C=C\c2n[nH]c3cc(ccc23)[C@@H]2C[C@@]22C(=O)Nc3ccccc23)c(C)n1
: