Target
Aurora kinase B
Ligand
BDBM375463
Substrate
Meas. Tech.
Inhibition Assay
IC50
<100±n/a nM
Citation
 Sampson, PBLiu, YLi, SForrest, BTPauls, HWEdwards, LGFeher, MPatel, NKLaufer, R Kinase inhibitors and method of treating cancer US Patent  US10358436 Publication Date 7/23/2019 
Target
Name:
Aurora kinase B
Synonyms:
AIK2 AIM1 ARK2 AURKB_HUMAN Aurora B-INCENP Aurora kinase B (AURKB) STK-1 STK12 Serine/threonine-protein kinase aurora B
Type:
Protein
Mol. Mass.:
39327.72
Organism:
Homo sapiens (Human)
Description:
Q96GD4
Residue:
344
  
Inhibitor
Name:
BDBM375463
Synonyms:
US10358436, Example A172 | US9907800, Example A172
Type:
Small organic molecule
Emp. Form.:
C27H25N5O
Mol. Mass.:
435.5203
SMILES:
CN(C)Cc1ccc(\C=C\c2n[nH]c3cc(ccc23)C2C[C@@]22C(=O)Nc3ncccc23)cc1
: