Target
Serine/threonine-protein kinase PLK4 [1-391]
Ligand
BDBM375464
Substrate
Meas. Tech.
Inhibition Assay
IC50
<100±n/a nM
Citation
 Sampson, PBLiu, YLi, SForrest, BTPauls, HWEdwards, LGFeher, MPatel, NKLaufer, R Kinase inhibitors and method of treating cancer US Patent  US10358436 Publication Date 7/23/2019 
Target
Name:
Serine/threonine-protein kinase PLK4 [1-391]
Synonyms:
PLK4 SAK Serine/threonine-protein kinase PLK4
Type:
Protein
Mol. Mass.:
43940.49
Organism:
Homo sapiens (Human)
Description:
aa 1-391
Residue:
391
  
Inhibitor
Name:
BDBM375464
Synonyms:
US10358436, Example A173 | US9907800, Example A173
Type:
Small organic molecule
Emp. Form.:
C29H29N5O
Mol. Mass.:
463.5735
SMILES:
CN1CCN(CC1)c1ccc(cc1)-c1n[nH]c2cc(ccc12)C1C[C@@]11C(=O)Nc2ccc(C)cc12
: