Target
Aurora kinase B
Ligand
BDBM375464
Substrate
Meas. Tech.
Inhibition Assay
IC50
<100±n/a nM
Citation
 Sampson, PBLiu, YLi, SForrest, BTPauls, HWEdwards, LGFeher, MPatel, NKLaufer, R Kinase inhibitors and method of treating cancer US Patent  US10358436 Publication Date 7/23/2019 
Target
Name:
Aurora kinase B
Synonyms:
AIK2 AIM1 ARK2 AURKB_HUMAN Aurora B-INCENP Aurora kinase B (AURKB) STK-1 STK12 Serine/threonine-protein kinase aurora B
Type:
Protein
Mol. Mass.:
39327.72
Organism:
Homo sapiens (Human)
Description:
Q96GD4
Residue:
344
  
Inhibitor
Name:
BDBM375464
Synonyms:
US10358436, Example A173 | US9907800, Example A173
Type:
Small organic molecule
Emp. Form.:
C29H29N5O
Mol. Mass.:
463.5735
SMILES:
CN1CCN(CC1)c1ccc(cc1)-c1n[nH]c2cc(ccc12)C1C[C@@]11C(=O)Nc2ccc(C)cc12
: