Target
Leucine-rich repeat serine/threonine-protein kinase 2
Ligand
BDBM410701
Substrate
Meas. Tech.
in vitro peptide-based kinase assay
IC50
<100±n/a nM
Citation
 Hoflack, JBlom, PLavergne, OGomez, S Macrocyclic LRRK2 kinase inhibitors US Patent  US10377772 Publication Date 8/13/2019 
Target
Name:
Leucine-rich repeat serine/threonine-protein kinase 2
Synonyms:
Dardarin LRRK2_HUMAN Leucine-rich repeat serine/threonine-protein kinase 2 PARK8
Type:
Protein
Mol. Mass.:
286113.20
Organism:
Homo sapiens (Human)
Description:
Q5S007
Residue:
2527
  
Inhibitor
Name:
BDBM410701
Synonyms:
US10377772, Compound N2
Type:
Small organic molecule
Emp. Form.:
C19H21FN6
Mol. Mass.:
352.4086
SMILES:
Fc1ccc2NC[C@@H]3CCCN3CCNc3ccn4ncc(-c1c2)c4n3
: